{"text_format":"1","workbook":"xlsx","n_sheets":4,"sheets":["Ganztagsrechner","Rhythmisierungsrechner","Zeitraster","Zeiten"],"not_rendered":{"charts":0,"images":0,"macros":1,"external_links":0,"defined_names":4,"comments":3,"pivot_tables":0},"unopened":[],"bounds":{"document_bytes":16777216,"sheet_cells":100000,"rows_first":2000,"rows_last":500,"rows_between":2000,"halvings":0,"cell_chars":16384,"cell_head_chars":4096},"cells_cut":0,"cells_raw":0,"read":"whole","date_system":"1904"}

{"sheet":"Ganztagsrechner","index":0,"n_rows":51,"n_cols":40,"rows_kept":51,"cut":false,"hidden":false,"merged":[[3,3,3,36],[12,5,13,5],[12,6,13,6],[7,27,7,29],[5,24,5,29],[5,31,5,36],[8,4,8,5],[7,4,7,5],[10,31,10,35]]}
[]
[]
[]
[]
[]
[null,null,null,"BASS 11-11 Nr.1               §7  Vo zu §93",null,null,null,null,null,"§5  Vo zu §93",null,null,null,"§2     Abs.(5)",null,null,null,null,null,null,null,null,null,null,"Stellen und Stellenanteile berechnen",null,null,null,null,null,null,"Kapitalisierung ab 1.8.2022"]
[null,null,null,null,null,null,null,null,null,null,null,null,null,null,null,null,null,null,null,null,null,null,null,null,"Stunden",null,null,null,"Schulform",null,null,"Stelle",null,null,null,null,"Kapitalisierungssumme"]
[null,null,null,null,"Schülerzahl:",null,740,"Schulform",null,"Leitungszeitstunden",null,null,null,"Anrechnungsstunden",null,null,null,null,null,null,null,null,null,null,110,{"$f":"0.039215686","v":3.9215686E-2},{"$f":"Z8*Y8","v":4.3137254599999997},"GY SEK GE",null,null,null,"3,6",null,null,null,null,{"$f":"AK11*AF8","v":197136}]
[null,null,null,"§8 VO zu §93","Schüler/Lehrer Relation:",null,"19,87","GY-Sek I",null,"9 WS+0,7 pro Stelle bis zur 50.Stelle",null,null,null,0.4,null,null,{"$f":"G20*N9","v":17.779365878208356},null,null,null,null,null,null,null,null,null,"Stellen"]
[null,null,null,null,null,"Grundstellen",{"$f":"G8/G9","v":37.242073477604428},null,null,null,null,null,null,"neu: 0,4 pro Stelle",null,"Summe",{"$f":"ROUND(Q9,0)","v":18},null,null,null,null,null,null,null,{"$f":"AA10*25.5","v":51},null,2,null,null,null,"Schülerzahl",0,null,null,null,null,{"$f":"AK11*AF10","v":0}]
[null,null,null,null,null,null,null,null,null,null,null,null,null,1,null,null,null,null,null,null,null,null,null,null,null,null,null,null,null,null,null,"501-700 Schüler",null,null,null,null,"54760,00"]
[null,null,null,null,null,null,{"$f":"ROUND(G10/0.5,0)*0.5","v":37},"auf halbe Stelle gerundet",null,null,null,null,null,2,null,null,null,null,null,null,null,null,null,null,{"$f":"AA12*25.5","v":35.699999999999996},null,1.4,null,null,null,null,"bis 3,6 Stellen Kap."]
[null,null,null,null,"SchülerInnen",740,{"$f":"F13/$G$9*0.2","v":7.4484146955208859},"20%",null,"LZ inkl. GT",{"$f":"($G$15*0.7+9)","v":40.113890286864617},null,null,3,null,null,null,null,null,null,null,null,null,null,null,null,null,null,null,null,null," bei 54760,00€ pro Lehrerstelle"]
[null,null,null,null,"im Ganztag",null,null,"Zuschl.",{"$f":"ROUND(I12,0)","v":0},"gerundet",{"$f":"ROUND(K13,0)","v":40},null,null,4]
[null,null,null,null,"Summe Stellen",null,{"$f":"SUM(G12+G13)","v":44.448414695520889},null,null,"§5 (2) zusätzl. 2 Std.",0,null,null,5,null,null,null,null,null,null,null,null,null,null,{"$f":"SUM(Y10:Y12)","v":86.699999999999989},"Summe",{"$f":"SUM(AA10,AA12)","v":3.4},null,null,null,null,null,null,null,null,null,{"$f":"SUM(AK8:AK12)","v":197136}]
[null,null,null,"§9 VO zu §93","sonst. Stellen-Zuschläge",null,0,null,null,"10.2.3. AVO-RL zusätzl. 1 Std.",1,null,null,6,null,null,null,null,null,null,null,null,null,null,null,null,null,null,"Schüler","Stellen","Betrag"]
[null,null,null,null,null,null,0,null,null,null,null,null,null,7,null,null,null,null,null,null,null,null,null,null,null,null,null,1,"<300",-2.2000000000000002,112300,5104.5,"pro 0,1",null,null,null,"Lehrerstelle"]
[null,null,null,null,null,null,0,null,null,null,null,null,null,8,null,null,null,null,null,null,null,null,null,null,null,null,null,2,"301-500",-2.9,149800,5165.5,"pro 0,1",null,null,null,"Lehrerstelle"]
[null,null,null,null,null,null,0,null,null,null,null,null,null,9,null,null,null,null,null,null,null,null,null,null,"Stunden","GY GE SEK","Stellen",3,"501-700",-3.6,187200,5200,"pro 0,1",null,null,null,"Lehrerstelle"]
[null,null,null,null,"Stellen insges.",null,{"$f":"SUM(G15:G19)","v":44.448414695520889},null,null,"Summe LZ",{"$f":"SUM($K$14:$K$19)","v":41},null,null,10,null,null,null,null,null,null,null,null,null,null,25.5,{"$f":"0.039215686","v":3.9215686E-2},{"$f":"Z20*Y20","v":0.99999999299999998},4,">700",-4.3,224600,5223.55,"pro 0,1",null,null,null,"Lehrerstelle"]
[null,null,null,null,null,null,null,null,null,null,null,null,null,11,null,null,null,null,null,null,null,null,null,null,0,{"$f":"0.039215686","v":3.9215686E-2},{"$f":"Z21*Y21","v":0}]
[null,null,null,null,null,null,null,null,null,"Schulleiterin",null,null,null,12,null,null,null,null,null,null,null,null,null,null,0,{"$f":"0.039215686","v":3.9215686E-2},0]
[null,null,null,null,null,null,null,null,null,"Schulleiter/in",25.5,null,null,13,null,null,null,null,null,null,null,null,null,null,0,{"$f":"0.039215686","v":3.9215686E-2},0]
[null,null,null,null,null,null,null,null,null,null,0,"ermäß.",null,14,null,null,null,null,null,null,null,null,null,null,0,{"$f":"0.039215686","v":3.9215686E-2},0]
[null,null,null,null,null,null,null,null,null,null,0,"ermäß.",null,15,null,null,null,null,null,null,null,null,null,null,0,{"$f":"0.039215686","v":3.9215686E-2},0]
[null,null,null,null,null,null,null,null,null,null,0,"ermäß.",null,16,null,null,null,null,null,null,null,null,null,null,0,{"$f":"0.039215686","v":3.9215686E-2},0]
[null,null,null,null,null,null,null,null,null,null,0,null,null,17,null,null,null,null,null,null,null,null,null,null,0,{"$f":"0.039215686","v":3.9215686E-2},0]
[null,null,null,null,null,null,null,null,null,null,{"$f":"SUM(K24:K27)","v":0},null,null,18]
[null,null,null,null,null,null,null,null,null,null,{"$f":"K23-K28","v":25.5},"Summe",null,19,null,null,null,null,null,null,null,null,null,null,{"$f":"SUM(Y20:Y27)","v":25.5},null,{"$f":"SUM(AA20:AA27)","v":0.99999999299999998}]
[null,null,null,null,null,null,null,null,null,"Konrektor",null,null,null,20]
[null,null,null,null,null,null,null,null,null,"Stellvertr. Schulleiter/in",25.5,null,null,21]
[null,null,null,null,null,null,null,null,null,null,7,"ermäß.",null,22]
[null,null,null,null,null,null,null,null,null,null,1,"ermäß.",null,23]
[null,null,null,null,null,null,null,null,null,null,0,"ermäß.",null,24]
[null,null,null,null,null,null,null,null,null,null,{"$f":"SUM(K32:K34)","v":8},null,null,25]
[null,null,null,null,null,null,null,null,null,"2. Konrektor",{"$f":"K31-K35","v":17.5},"Summe",null,26]
[null,null,null,null,null,null,null,null,null,"N.N.",25.5,null,null,27]
[null,null,null,null,"Schüler-Lehrerrelationen",null,"alt","neu",null,null,0,"ermäß.",null,28]
[null,null,null,null,"Grundschule",null,23.42,21.95,null,null,0,"ermäß.",null,29]
[null,null,null,null,"Hauptschule",null,17.86,17.86,null,null,{"$f":"SUM(K38:K39)","v":0},null,null,30]
[null,null,null,null,"Realschule",null,20.94,20.190000000000001,null,null,{"$f":"K37-K40","v":25.5},"Summe",null,31]
[null,null,null,null,"Sekundarschule",null,16.27,16.27,null,null,null,"%",null,32]
[null,null,null,null,null,null,null,null,null,null,null,null,null,33]
[null,null,null,null,"Gymnasium","SekI*",19.88,19.87,null,"SL %",{"$f":"K20*L44/100","v":26.65},65,null,34]
[null,null,null,null,null,"SekII",13.41,12.7,null,"Kon %",{"$f":"K20*L45/100","v":14.35},35,null,35]
[null,null,null,null,"Gesamtschule","SekI",19.32,18.63,null,"2.Kon %",{"$f":"K20*L46/100","v":0},0,null,36]
[null,null,null,null,null,"SekII",13.19,12.7,null,"Rektor Std.",{"$f":"K29-K44","v":-1.1499999999999986},null,null,37]
[null,null,null,null,null,null,null,null,null,"Konrektor Std.",{"$f":"K36-K45","v":3.1500000000000004},null,null,38]
[null,null,null,null,null,"* Sek I G8 19,17",null,null,null,"2. Konrektor Std.",{"$f":"K41-K46","v":25.5},null,null,39]
[null,null,null,null,null,null,null,null,null,null,null,{"$f":"IF(L51=100,\"\",\"Fehler in der Summe der SL-Ermäßigung! Der Wert der SL-Ermäßigung entspricht nicht 100 %!\")","v":""},null,null,null,null,{"$f":"IF(Q51=Q10,\"\",IF(Q51<Q10,AN51,IF(Q51>Q10,AN50,)))","v":"es können noch Anrechnungsstunden vergeben werden"},null,null,null,null,null,null,null,null,null,null,null,null,null,null,null,null,null,null,null,null,null,null,"es wurden zu viele Anrechnungsstunden an die KollegInnen vergeben!"]
[null,null,null,null,null,null,null,null,null,null,null,{"$f":"SUM(L44:L46)","v":100},null,null,null,null,{"$f":"SUM(Q11:Q49)","v":0},null,null,null,null,null,null,null,null,null,null,null,null,null,null,null,null,null,null,null,null,null,null,"es können noch Anrechnungsstunden vergeben werden"]

{"sheet":"Rhythmisierungsrechner","index":1,"n_rows":44,"n_cols":10,"rows_kept":44,"cut":false,"hidden":false,"merged":[[5,1,5,10]]}
[]
[]
[]
[]
[]
[]
[]
[null,null,"Berechnung nach Stunden"]
[null,null,null,null,"Stelle"]
[null,null,null,null,{"$f":"$D$12*$E$12","v":0.99999999299999998},null,"Gymnasium","SEK GY GE"]
[null,null,"Minuten",null,"Wochenstunden",null,"Rest-Minuten",null,"Min/Woche","Stunden/Woche"]
[null,null,45,"0,039215686",25.5,null,null,null,{"$f":"C12*E12","v":1147.5},{"$f":"TIME(0,$I$12,0)","v":0.79652777777777783}]
[null,null,67.5,{"$f":"C13/1440","v":"01:07:30"},{"$f":"INT(I12/C13)","v":17},{"$f":"MOD(I12/C13,1)","v":0},{"$f":"F13*C13","v":0},{"$f":"TIME(0,G13,0)","v":0}]
[null,null,45,{"$f":"C14/1440","v":"00:45:00"},{"$f":"INT(I12/C14)","v":25},{"$f":"MOD(I12/C14,1)","v":0.5},{"$f":"F14*C14","v":22.5},{"$f":"TIME(0,G14,0)","v":1.5277777777777777E-2}]
[null,null,null,null,"Einheiten/Woche",null,"Restminuten","Restzeit"]
[]
[null,null,"Berechnung nach Stellen"]
[null,null,null,null,25.5,null,null,{"$f":"IF(E18=25.5,\"GY SEK GE\",\"RS HS GS\")","v":"GY SEK GE"}]
[null,null,"Minuten",null,"Wochenstunden",null,null,"Stelle","Min/Woche","Stunden/Woche"]
[null,null,45,{"$f":"1/28","v":3.5714285714285712E-2},{"$f":"H20*E18","v":25.5},null,null,1,{"$f":"C20*E20","v":1147.5},{"$f":"TIME(0,$I$20,0)","v":0.79652777777777783}]
[null,null,67.5,{"$f":"C21/1440","v":"01:07:30"},{"$f":"INT(I20/C21)","v":17},{"$f":"MOD(I20/C21,1)","v":0},{"$f":"F21*C21","v":0},{"$f":"TIME(0,G21,0)","v":0}]
[null,null,45,{"$f":"C22/1440","v":"00:45:00"},{"$f":"INT(I20/C22)","v":25},{"$f":"MOD(I20/C22,1)","v":0.5},{"$f":"F22*C22","v":22.5},{"$f":"TIME(0,G22,0)","v":1.5277777777777777E-2}]
[null,null,null,null,"Einheiten/Woche",null,null,"Restzeit"]
[]
[]
[]
[]
[]
[]
[null,"1. Grundschule 28"]
[null,"2. Hauptschule 28"]
[null,"3. Realschule 28"]
[null,"4. Gemeinschaftsschule 25,5"]
[null,"5. Sekundarschule 25,5"]
[null,"6. Gymnasium 25,5"]
[null,"7. Gesamtschule 25,5"]
[null,"8. Berufskolleg 25,5"]
[null,"9. Förderschule 27,5"]
[null,"10. Schule für Kranke 27,5"]
[null,"11. Weiterbildungskolleg"]
[null,"    a) Abendrealschule 25"]
[null,"    b) Abendgymnasium 22"]
[null,"   c) Kolleg (Institut zur Erlangung der Hochschulreife) 22"]
[null,"12. Studienkolleg für ausländische Studierende 22"]

{"sheet":"Zeitraster","index":2,"n_rows":45,"n_cols":11,"rows_kept":45,"cut":false,"hidden":false,"merged":[]}
[]
[null,null,null,null,"Std.","Min"]
[null,null,null,"Start Uhrzeit",8,0,null,null,12,{"$f":"E7/1440","v":"00:05:00"}]
[null,null,null,null,"Minuten",null,null,null,23,"00:15:00"]
[null,null,null,"Einheiten/Stunden zu",45,null,null,null,34,"00:05:00"]
[null,null,null,"Pausenzeit zwischen",null,null,null,null,45,"00:15:00"]
[null,null,null,"1. und 2.",5,null,null,null,56,"00:05:00"]
[null,null,null,"2. und 3.",15,null,null,null,67,"01:00:00"]
[null,null,null,"3. und 4.",5,null,null,null,78,"00:05:00"]
[null,null,null,"4. und 5.",15,null,null,null,89,"00:10:00"]
[null,null,null,"5. und 6.",5,null,null,null,910,"00:00:00"]
[null,null,null,"6. und 7.",60,null,null,null,1011,{"$f":"E16/1440","v":"00:10:00"}]
[null,null,null,"7. und 8.",5,null,null,null,1112,"00:00:00"]
[null,null,null,"8. und 9.",10,null,null,null,1213,"00:10:00"]
[null,null,null,"9.und 10.",0,null,null,null,1314,"00:00:00"]
[null,null,null,"10. und 11.",10,null,null,null,1415,"00:10:00"]
[null,null,null,"11. und 12.",0,null,null,null,1516,{"$f":"E21/1440","v":"00:00:00"}]
[null,null,null,"12. und 13.",10]
[null,null,null,"13. und 14.",0]
[null,null,null,"14. und 15.",10]
[null,null,null,"15. und 16.",0]
[null,null,null,null,null,null,null,null,"Rhythmus",{"$f":"E5/1440","v":"00:45:00"},"Einheit (Std./Min.)"]
[null,null,null,1,{"$f":"TIME($E$3,$F$3,0)","v":"08:00:00"},{"$f":"E23+$J$22","v":"08:45:00"},null,null,"Pausen zwischen Std."]
[null,null,null,2,{"$f":"F23+J3","v":"08:50:00"},{"$f":"E24+$J$22","v":"09:35:00"},null,null,"1. große Pause",{"$f":"E13/1440","v":"00:05:00"}]
[null,null,null,null,{"$f":"J4","v":"00:15:00"},{"$f":"IF(E8=0,\"\",IF(AND(E8<60,E8>0),\"Minuten\",IF(E8>=60,\"Stunde\")))","v":"Minuten"},null,null,"2. große Pause",{"$f":"E14/1440","v":"00:10:00"}]
[null,null,null,3,{"$f":"F24+E25","v":"09:50:00"},{"$f":"E26+$J$22","v":"10:35:00"},null,null,"Mittagspause",{"$f":"E15/1440","v":"00:00:00"}]
[null,null,null,4,{"$f":"F26+J5","v":"10:40:00"},{"$f":"E27+J22","v":"11:25:00"},null,null,"3. Pause",{"$f":"E16/1440","v":"00:10:00"}]
[null,null,null,null,{"$f":"J6","v":"00:15:00"},{"$f":"IF(E10=0,\"\",IF(AND(E10<60,E10>0),\"Minuten\",IF(E10>=60,\"Stunde\")))","v":"Minuten"},null,null,"4. Pause",{"$f":"E17/1440","v":"00:00:00"}]
[null,null,null,5,{"$f":"F27+E28","v":"11:40:00"},{"$f":"E29+J22","v":"12:25:00"}]
[null,null,null,6,{"$f":"F29+J7","v":"12:30:00"},{"$f":"E30+J22","v":"13:15:00"}]
[null,null,null,null,{"$f":"J8","v":"01:00:00"},{"$f":"IF(E12=0,\"\",IF(AND(E12<60,E12>0),\"Minuten\",IF(E12>=60,\"Stunde\")))","v":"Stunde"}]
[null,null,null,7,{"$f":"F30+E31","v":"14:15:00"},{"$f":"E32+J22","v":"15:00:00"}]
[null,null,null,8,{"$f":"F32+J9","v":"15:05:00"},{"$f":"E33+$J$22","v":"15:50:00"}]
[null,null,null,null,{"$f":"J10","v":"00:10:00"},{"$f":"IF(E14=0,\"\",IF(AND(E14<60,E14>0),\"Minuten\",IF(E14>=60,\"Stunde\")))","v":"Minuten"}]
[null,null,null,9,{"$f":"F33+J10","v":"16:00:00"},{"$f":"E35+$J$22","v":"16:45:00"}]
[null,null,null,10,{"$f":"F35+J11","v":"16:45:00"},{"$f":"E36+$J$22","v":"17:30:00"}]
[null,null,null,null,{"$f":"J12","v":"00:10:00"},{"$f":"IF(E16=0,\"\",IF(AND(E16<60,E16>0),\"Minuten\",IF(E16>=60,\"Stunde\")))","v":"Minuten"}]
[null,null,null,11,{"$f":"F36+J12","v":"17:40:00"},{"$f":"E38+$J$22","v":"18:25:00"}]
[null,null,null,12,{"$f":"F38+J13","v":"18:25:00"},{"$f":"E39+$J$22","v":"19:10:00"}]
[null,null,null,null,{"$f":"J14","v":"00:10:00"},{"$f":"IF(E18=0,\"\",IF(AND(E18<60,E18>0),\"Minuten\",IF(E18>=60,\"Stunde\")))","v":"Minuten"}]
[null,null,null,13,{"$f":"F39+J14","v":"19:20:00"},{"$f":"E41+$J$22","v":"20:05:00"}]
[null,null,null,14,{"$f":"F41+J15","v":"20:05:00"},{"$f":"E42+$J$22","v":"20:50:00"}]
[null,null,null,null,{"$f":"J16","v":"00:10:00"},{"$f":"IF(E20=0,\"\",IF(AND(E20<60,E20>0),\"Minuten\",IF(E20>=60,\"Stunde\")))","v":"Minuten"}]
[null,null,null,15,{"$f":"F42+J16","v":"21:00:00"},{"$f":"E44+$J$22","v":"21:45:00"}]
[null,null,null,16,{"$f":"F44+J17","v":"21:45:00"},{"$f":"E45+$J$22","v":"22:30:00"}]

{"sheet":"Zeiten","index":3,"n_rows":34,"n_cols":21,"rows_kept":34,"cut":false,"hidden":false,"merged":[]}
[]
[]
[]
[]
[]
[null,null,null,"Stand:",{"$f":"NOW()","v":"2024-03-15T12:10:49.410"},null,null,null,null,null,null,null,{"$f":"NOW()","v":"2024-03-15T12:10:49.410"},null,null,null,null,null,null,{"$f":"NOW()","v":"2024-03-15T12:10:49.410"}]
[null,null,null,null,"Name","Vorname",null,null,null,null,null,null,"Name","Vorname",null,null,null,null,null,"Name","Vorname"]
[null,1,{"$f":"Zeitraster!E23","v":0.33333333333333331},{"$f":"Zeitraster!F23","v":0.36458333333333331},null,null,null,null,null,1,{"$f":"C8","v":0.33333333333333331},{"$f":"D8","v":0.36458333333333331},null,null,null,null,1,{"$f":"C8","v":0.33333333333333331},{"$f":"D8","v":0.36458333333333331}]
[null,2,{"$f":"Zeitraster!E24","v":0.36805555555555552},{"$f":"Zeitraster!F24","v":0.39930555555555552},null,null,null,null,null,2,{"$f":"C9","v":0.36805555555555552},{"$f":"D9","v":0.39930555555555552},null,null,null,null,2,{"$f":"C9","v":0.36805555555555552},{"$f":"D9","v":0.39930555555555552}]
[null,null,{"$f":"Zeitraster!E25","v":1.0416666666666666E-2},{"$f":"Zeitraster!F25","v":"Minuten"},null,null,null,null,null,null,1.0416666666666666E-2,"Minuten",null,null,null,null,null,1.0416666666666666E-2,"Minuten"]
[null,3,{"$f":"Zeitraster!E26","v":0.40972222222222221},{"$f":"Zeitraster!F26","v":0.44097222222222221},null,null,null,null,null,3,0.40972222222222221,0.44097222222222221,null,null,null,null,3,0.40972222222222221,0.44097222222222221]
[null,4,{"$f":"Zeitraster!E27","v":0.44444444444444442},{"$f":"Zeitraster!F27","v":0.47569444444444442},null,null,null,null,null,4,0.44444444444444442,0.47569444444444442,null,null,null,null,4,0.44444444444444442,0.47569444444444442]
[null,null,{"$f":"Zeitraster!E28","v":1.0416666666666666E-2},{"$f":"Zeitraster!F28","v":"Minuten"},null,null,null,null,null,null,1.0416666666666666E-2,"Minuten",null,null,null,null,null,1.0416666666666666E-2,"Minuten"]
[null,5,{"$f":"Zeitraster!E29","v":0.4861111111111111},{"$f":"Zeitraster!F29","v":0.51736111111111116},null,null,null,null,null,5,0.4861111111111111,0.51736111111111116,null,null,null,null,5,0.4861111111111111,0.51736111111111116]
[null,6,{"$f":"Zeitraster!E30","v":0.52083333333333337},{"$f":"Zeitraster!F30","v":0.55208333333333337},null,null,null,null,null,6,0.52083333333333337,0.55208333333333337,null,null,null,null,6,0.52083333333333337,0.55208333333333337]
[null,null,{"$f":"Zeitraster!E31","v":4.1666666666666664E-2},{"$f":"Zeitraster!F31","v":"Stunde"},null,null,null,null,null,null,4.1666666666666664E-2,"Stunde",null,null,null,null,null,4.1666666666666664E-2,"Stunde"]
[null,7,{"$f":"Zeitraster!E32","v":0.59375},{"$f":"Zeitraster!F32","v":0.625},null,null,null,null,null,7,0.59375,0.625,null,null,null,null,7,0.59375,0.625]
[null,8,{"$f":"Zeitraster!E33","v":0.62847222222222221},{"$f":"Zeitraster!F33","v":0.65972222222222221},null,null,null,null,null,8,0.62847222222222221,0.65972222222222221,null,null,null,null,8,0.62847222222222221,0.65972222222222221]
[null,null,{"$f":"Zeitraster!E34","v":6.9444444444444441E-3},{"$f":"Zeitraster!F34","v":"Minuten"},null,null,null,null,null,null,6.9444444444444441E-3,"Minuten",null,null,null,null,null,6.9444444444444441E-3,"Minuten"]
[null,9,{"$f":"Zeitraster!E35","v":0.66666666666666663},{"$f":"Zeitraster!F35","v":0.69791666666666663},null,null,null,null,null,9,0.66666666666666663,0.69791666666666663,null,null,null,null,9,0.66666666666666663,0.69791666666666663]
[null,10,{"$f":"Zeitraster!E36","v":0.69791666666666663},{"$f":"Zeitraster!F36","v":0.72916666666666663},null,null,null,null,null,10,0.69791666666666663,0.72916666666666663,null,null,null,null,10,0.69791666666666663,0.72916666666666663]
[null,null,{"$f":"Zeitraster!E37","v":6.9444444444444441E-3},{"$f":"Zeitraster!F37","v":"Minuten"},null,null,null,null,null,null,6.9444444444444441E-3,"Minuten",null,null,null,null,null,6.9444444444444441E-3,"Minuten"]
[null,11,{"$f":"Zeitraster!E38","v":0.73611111111111105},{"$f":"Zeitraster!F38","v":0.76736111111111105},null,null,null,null,null,11,0.73611111111111105,0.76736111111111105,null,null,null,null,11,0.73611111111111105,0.76736111111111105]
[null,12,{"$f":"Zeitraster!E39","v":0.76736111111111105},{"$f":"Zeitraster!F39","v":0.79861111111111105},null,null,null,null,null,12,0.76736111111111105,0.79861111111111105,null,null,null,null,12,0.76736111111111105,0.79861111111111105]
[null,null,{"$f":"Zeitraster!E40","v":6.9444444444444441E-3},{"$f":"Zeitraster!F40","v":"Minuten"},null,null,null,null,null,null,6.9444444444444441E-3,"Minuten",null,null,null,null,null,6.9444444444444441E-3,"Minuten"]
[null,13,{"$f":"Zeitraster!E41","v":0.80555555555555547},{"$f":"Zeitraster!F41","v":0.83680555555555547},null,null,null,null,null,13,0.80555555555555547,0.83680555555555547,null,null,null,null,13,0.80555555555555547,0.83680555555555547]
[null,14,{"$f":"Zeitraster!E42","v":0.83680555555555547},{"$f":"Zeitraster!F42","v":0.86805555555555547},null,null,null,null,null,14,0.83680555555555547,0.86805555555555547,null,null,null,null,14,0.83680555555555547,0.86805555555555547]
[null,null,{"$f":"Zeitraster!E43","v":6.9444444444444441E-3},{"$f":"Zeitraster!F43","v":"Minuten"},null,null,null,null,null,null,6.9444444444444441E-3,"Minuten",null,null,null,null,null,6.9444444444444441E-3,"Minuten"]
[null,15,{"$f":"Zeitraster!E44","v":0.87499999999999989},{"$f":"Zeitraster!F44","v":0.90624999999999989},null,null,null,null,null,15,0.87499999999999989,0.90624999999999989,null,null,null,null,15,0.87499999999999989,0.90624999999999989]
[null,16,{"$f":"Zeitraster!E45","v":0.90624999999999989},{"$f":"Zeitraster!F45","v":0.93749999999999989},null,null,null,null,null,16,0.90624999999999989,0.93749999999999989,null,null,null,null,16,0.90624999999999989,0.93749999999999989]
[null,null,{"$f":"Zeitraster!E46","v":0},null,null,null,null,null,null,null,null,null,null,null,null,null,null,0,0]
[null,null,{"$f":"Zeitraster!E47","v":0},null,null,null,null,null,null,null,null,null,null,null,null,null,null,0,0]
[null,null,{"$f":"Zeitraster!E48","v":0}]
[null,null,{"$f":"Zeitraster!E49","v":0}]